Target
Lysine-specific demethylase 5A
Ligand
BDBM264046
Substrate
Meas. Tech.
In Vitro Enzyme Inhibition Assay
IC50
<100±n/a nM
Citation
 Nie, ZStafford, JAVeal, JMWallace, MB Histone demethylase inhibitors US Patent  US9908865 Publication Date 3/6/2018 
Target
Name:
Lysine-specific demethylase 5A
Synonyms:
Histone demethylase JARID1A Jumonji/ARID domain-containing protein 1A KDM5A_HUMAN RBBP-2 RBP2 | Retinoblastoma-binding protein 2
Type:
Protein
Mol. Mass.:
192091.79
Organism:
Homo sapiens (Human)
Description:
P29375
Residue:
1690
  
Inhibitor
Name:
BDBM264046
Synonyms:
2-[5-[(2-fluoro-4- methylphenyl)methoxy]pyrazol-1- yl]pyridine-4-carboxylic acid US9604961, Example 131 US9908865, Example 131
Type:
Small organic molecule
Emp. Form.:
C17H14FN3O3
Mol. Mass.:
327.3098
SMILES:
Cc1ccc(COc2ccnn2-c2cc(ccn2)C(O)=O)c(F)c1
: