Target
Lysine-specific demethylase 4C
Ligand
BDBM264046
Substrate
Meas. Tech.
In Vitro Enzyme Inhibition Assay
IC50
550±n/a nM
Citation
 Nie, ZStafford, JAVeal, JMWallace, MB Histone demethylase inhibitors US Patent  US9908865 Publication Date 3/6/2018 
Target
Name:
Lysine-specific demethylase 4C
Synonyms:
GASC-1 protein Gene amplified in squamous cell carcinoma 1 protein JMJD2C Jumonji domain-containing protein 2C KDM4C_HUMAN | KIAA0780
Type:
Protein
Mol. Mass.:
119979.01
Organism:
Homo sapiens (Human)
Description:
Q9H3R0
Residue:
1056
  
Inhibitor
Name:
BDBM264046
Synonyms:
2-[5-[(2-fluoro-4- methylphenyl)methoxy]pyrazol-1- yl]pyridine-4-carboxylic acid US9604961, Example 131 US9908865, Example 131
Type:
Small organic molecule
Emp. Form.:
C17H14FN3O3
Mol. Mass.:
327.3098
SMILES:
Cc1ccc(COc2ccnn2-c2cc(ccn2)C(O)=O)c(F)c1
: