Target
Amine oxidase [flavin-containing] A
Ligand
BDBM243404
Substrate
Meas. Tech.
Inhibition Assay
IC50
23000±n/a nM
Citation
 Matsumoto, SHattori, YToyofuku, MMorimoto, SDaini, MKojima, TKaku, TIto, M Cyclopropanamine compound and use thereof US Patent  US9920047 Publication Date 3/20/2018 
Target
Name:
Amine oxidase [flavin-containing] A
Synonyms:
AOFA_HUMAN MAO-A Monoamine oxidase Monoamine oxidase type A (MAO A) Monoamine oxidase type A (MAOA)
Type:
Protein
Mol. Mass.:
59689.53
Organism:
Homo sapiens (Human)
Description:
P21397
Residue:
527
  
Inhibitor
Name:
BDBM243404
Synonyms:
N-cyclopentyl-5- ((1R,2R)-2- (tetrahydro-2H- pyran-4-ylamino)- cyclopropyl)thio- phene-3-carboxamide US10053456, 39 US10968213, Example 39 US9920047, 39
Type:
Small organic molecule
Emp. Form.:
C18H26N2O2S
Mol. Mass.:
334.476
SMILES:
O=C(NC1CCCC1)c1csc(c1)C1CC1NC1CCOCC1
: