Target
Amine oxidase [flavin-containing] B
Ligand
BDBM243418
Substrate
Meas. Tech.
Inhibition Assay
IC50
>100000±n/a nM
Citation
 Matsumoto, SHattori, YToyofuku, MMorimoto, SDaini, MKojima, TKaku, TIto, M Cyclopropanamine compound and use thereof US Patent  US9920047 Publication Date 3/20/2018 
Target
Name:
Amine oxidase [flavin-containing] B
Synonyms:
AOFB_HUMAN MAOB Monoamine oxidase type B (MAO B) Monoamine oxidase type B (MAOB)
Type:
Protein
Mol. Mass.:
58768.76
Organism:
Homo sapiens (Human)
Description:
P27338
Residue:
520
  
Inhibitor
Name:
BDBM243418
Synonyms:
5-((1R,2R)-2- ((tetrahydro-2H- pyran-4-ylmethyl)- amino)cyclopropyl)- N-(1-(2,2,2- trifluoroethyl)- piperidin-4- yl)thiophene-3- carboxamide US10414761, Example 52 US9718814, 52 | US9920047, 52
Type:
Small organic molecule
Emp. Form.:
C21H30F3N3O2S
Mol. Mass.:
445.542
SMILES:
FC(F)(F)CN1CCC(CC1)NC(=O)c1csc(c1)[C@@H]1C[C@H]1NCC1CCOCC1
: