Target
Geranylgeranyl pyrophosphate synthase
Ligand
BDBM25289
Substrate
BDBM25257
Meas. Tech.
GGPP Synthase Inhibition Assay
IC50
4070±n/a nM
Citation
 K-M Chen, CHudock, MPZhang, YGuo, RTCao, RNo, JHLiang, PHKo, TPChang, THChang, SCSong, YAxelson, JKumar, AWang, AHOldfield, E Inhibition of geranylgeranyl diphosphate synthase by bisphosphonates: a crystallographic and computational investigation. J Med Chem 51:5594-607 (2008)  
Target
Name:
Geranylgeranyl pyrophosphate synthase
Synonyms:
Dimethylallyltranstransferase GGPP synthetase GGPPSase Geranylgeranyl Diphosphate Synthase (GGPPS) Geranylgeranyl pyrophosphate synthetase | Geranyltranstransferase
Type:
Homooctamer; transferase
Mol. Mass.:
34867.94
Organism:
Homo sapiens (Human)
Description:
Recombinant human GGPPS was cloned and expressed in E. coli.
Residue:
300
  
Inhibitor
Name:
BDBM25289
Synonyms:
bisphosphonate, 38 | {1-hydroxy-2-[3-(3-phenylphenyl)phenoxy]-1-phosphonoethyl}phosphonic acid
Type:
Small organic molecule
Emp. Form.:
C20H20O8P2
Mol. Mass.:
450.3155
SMILES:
OC(COc1cccc(c1)-c1cccc(c1)-c1ccccc1)(P(O)(O)=O)P(O)(O)=O
:
Substrate
Name:
BDBM25257
Synonyms:
({hydroxy[(3-methylbut-3-en-1-yl)oxy]phosphoryl}oxy)phosphonic acid [14C]isopentenyl diphosphate
Type:
radiolabeled substrate
Emp. Form.:
C5H12O7P2
Mol. Mass.:
246.0921
SMILES:
CC(=C)CCOP(O)(=O)OP(O)(O)=O
: