Target
Dimer of Gag-Pol polyprotein [489-587]
Ligand
BDBM190
Substrate
fluorogenic peptide substrate
Meas. Tech.
Protease Inhibition Assay
pH
4.7±n/a
Temperature
303.15±n/a K
Ki
0.49±n/a nM
Comments
Citation
 Sham, HLZhao, CStewart, KDBetebenner, DALin, SPark, CHKong, XPRosenbrook, WHerrin, TMadigan, DVasavanonda, SLyons, NMolla, ASaldivar, AMarsh, KCMcDonald, EWideburg, NEDenissen, JFRobins, TKempf, DJPlattner, JJNorbeck, DW A novel, picomolar inhibitor of human immunodeficiency virus type 1 protease. J Med Chem 39:392-7 (1996)  
Target
Name:
Dimer of Gag-Pol polyprotein [489-587]
Synonyms:
HIV-1 Protease
Type:
Protein Complex
Mol. Mass.:
Description:
Components:
This complex has 2 components.
Component 1
Name:
Gag-Pol polyprotein [489-587]
Synonyms:
HIV protease HIV-1 Protease chain A POL_HV1N5 | gag-pol
Type:
Enzyme Subunit
Mol. Mass.:
10822.21
Organism:
Human immunodeficiency virus type 1
Description:
P12497[489-587]
Residue:
99
  
Component 2
Name:
Gag-Pol polyprotein [489-587]
Synonyms:
HIV protease HIV-1 Protease chain A POL_HV1N5 | gag-pol
Type:
Enzyme Subunit
Mol. Mass.:
10822.21
Organism:
Human immunodeficiency virus type 1
Description:
P12497[489-587]
Residue:
99
  
Inhibitor
Name:
BDBM190
Synonyms:
(5R,6R)-2,4-Bis[4-(hydroxymethyl)benzyl]-1-(3-furanylmethyl)-5-benzyl-6-hydroxy-3-oxo-1,2,4-triazacycloheptane Azacyclic Urea | Unnamed azacyclic urea
Type:
Emp. Form.:
C32H35N3O5
Mol. Mass.:
541.6374
SMILES:
OCc1ccc(CN2[C@H](Cc3ccccc3)[C@H](O)CN(Cc3ccoc3)N(Cc3ccc(CO)cc3)C2=O)cc1
:
Substrate
Name:
fluorogenic peptide substrate
Synonyms:
Type:
fluorogenic peptide
Mol. Mass.:
3550.86
Organism:
Description:
Residue:
33