Target
Dimer of Gag-Pol polyprotein [489-587]
Ligand
BDBM194
Substrate
fluorogenic peptide substrate
Meas. Tech.
Protease Inhibition Assay
pH
4.7±n/a
Temperature
303.15±n/a K
Ki
0.005±n/a nM
Comments
Citation
 Sham, HLZhao, CStewart, KDBetebenner, DALin, SPark, CHKong, XPRosenbrook, WHerrin, TMadigan, DVasavanonda, SLyons, NMolla, ASaldivar, AMarsh, KCMcDonald, EWideburg, NEDenissen, JFRobins, TKempf, DJPlattner, JJNorbeck, DW A novel, picomolar inhibitor of human immunodeficiency virus type 1 protease. J Med Chem 39:392-7 (1996)  
Target
Name:
Dimer of Gag-Pol polyprotein [489-587]
Synonyms:
HIV-1 Protease
Type:
Protein Complex
Mol. Mass.:
Description:
Components:
This complex has 2 components.
Component 1
Name:
Gag-Pol polyprotein [489-587]
Synonyms:
HIV protease HIV-1 Protease chain A POL_HV1N5 | gag-pol
Type:
Enzyme Subunit
Mol. Mass.:
10822.21
Organism:
Human immunodeficiency virus type 1
Description:
P12497[489-587]
Residue:
99
  
Component 2
Name:
Gag-Pol polyprotein [489-587]
Synonyms:
HIV protease HIV-1 Protease chain A POL_HV1N5 | gag-pol
Type:
Enzyme Subunit
Mol. Mass.:
10822.21
Organism:
Human immunodeficiency virus type 1
Description:
P12497[489-587]
Residue:
99
  
Inhibitor
Name:
BDBM194
Synonyms:
(5R,6R)-1,5-dibenzyl-6-hydroxy-2,4-bis[(4-hydroxy-3-methoxyphenyl)methyl]-1,2,4-triazepan-3-one A-98881
Type:
Emp. Form.:
C34H37N3O6
Mol. Mass.:
583.6741
SMILES:
COc1cc(CN2[C@H](Cc3ccccc3)[C@H](O)CN(Cc3ccccc3)N(Cc3ccc(O)c(OC)c3)C2=O)ccc1O
:
Substrate
Name:
fluorogenic peptide substrate
Synonyms:
Type:
fluorogenic peptide
Mol. Mass.:
3550.86
Organism:
Description:
Residue:
33