Target
Metallo-beta-lactamase type 2
Ligand
BDBM262255
Substrate
Meas. Tech.
Class B Enzyme Assay
pH
7±n/a
IC50
16.8±n/a nM
Comments
extracted
Citation
 Mandal, MTang, HXiao, LSu, JLi, GYang, SPan, WTang, HDeJesus, RHicks, JLombardo, MChu, HHagmann, WPasternak, AGu, XJiang, JDong, SDing, FLondon, CBiswas, DYoung, KHunter, DNZhao, ZYang, D Metallo-beta-lactamase inhibitors US Patent  US9708336 Publication Date 7/18/2017 
Target
Name:
Metallo-beta-lactamase type 2
Synonyms:
B2 metallo-beta-lactamase Beta-lactamase NDM-1 Metallo-beta-lactamase NDM-1 Metallo-beta-lactamase type II New Delhi metallo-beta-lactamase-1 | blaNDM-1
Type:
PROTEIN
Mol. Mass.:
28498.15
Organism:
Klebsiella pneumoniae
Description:
ChEMBL_103887
Residue:
270
  
Inhibitor
Name:
BDBM262255
Synonyms:
3-(5H-pyrrolo[2,3-b]pyrazin- 7-yl)-2-(2H-tetrazol-5- yl)benzenesulfonamide | US9708336, 104
Type:
Small organic molecule
Emp. Form.:
C13H10N8O2S
Mol. Mass.:
342.336
SMILES:
NS(=O)(=O)c1cccc(-c2c[nH]c3nccnc23)c1-c1nn[nH]n1
: