Target
VIM-1 metallo-beta-lactamase
Ligand
BDBM262512
Substrate
Meas. Tech.
Class B Enzyme Assay
pH
7±n/a
IC50
212±n/a nM
Comments
extracted
Citation
 Mandal, MTang, HXiao, LSu, JLi, GYang, SPan, WTang, HDeJesus, RHicks, JLombardo, MChu, HHagmann, WPasternak, AGu, XJiang, JDong, SDing, FLondon, CBiswas, DYoung, KHunter, DNZhao, ZYang, D Metallo-beta-lactamase inhibitors US Patent  US9708336 Publication Date 7/18/2017 
Target
Name:
VIM-1 metallo-beta-lactamase
Synonyms:
Beta-lactamase VIM-1 VIM-1 metallo-beta-lactamase | blaVIM-1
Type:
undefined
Mol. Mass.:
28014.53
Organism:
Klebsiella pneumoniae
Description:
Q5GN09
Residue:
266
  
Inhibitor
Name:
BDBM262512
Synonyms:
N-methyl-N-{[3'-sulfamoyl- 2'-(1H-tetrazol-5- yl)biphenyl-4- yl]methyl}glycine | US9708336, 364
Type:
Small organic molecule
Emp. Form.:
C17H18N6O4S
Mol. Mass.:
402.428
SMILES:
CN(CC(O)=O)Cc1ccc(cc1)-c1cccc(c1-c1nnn[nH]1)S(N)(=O)=O
: