Target
Metallo-beta-lactamase type 2
Ligand
BDBM262687
Substrate
Meas. Tech.
Class B Enzyme Assay
pH
7±n/a
IC50
0.199±n/a nM
Comments
extracted
Citation
 Mandal, MTang, HXiao, LSu, JLi, GYang, SPan, WTang, HDeJesus, RHicks, JLombardo, MChu, HHagmann, WPasternak, AGu, XJiang, JDong, SDing, FLondon, CBiswas, DYoung, KHunter, DNZhao, ZYang, D Metallo-beta-lactamase inhibitors US Patent  US9708336 Publication Date 7/18/2017 
Target
Name:
Metallo-beta-lactamase type 2
Synonyms:
B2 metallo-beta-lactamase Beta-lactamase NDM-1 Metallo-beta-lactamase NDM-1 Metallo-beta-lactamase type II New Delhi metallo-beta-lactamase-1 | blaNDM-1
Type:
PROTEIN
Mol. Mass.:
28498.15
Organism:
Klebsiella pneumoniae
Description:
ChEMBL_103887
Residue:
270
  
Inhibitor
Name:
BDBM262687
Synonyms:
3-(2-Aminobenzo[d]thiazol-4-yl)-6- (2-(piperidin-4-yl)ethyl)-2-(2H- tetrazol-5-yl)benzenesulfonamide | US9708336, 540
Type:
Small organic molecule
Emp. Form.:
C21H24N8O2S2
Mol. Mass.:
484.598
SMILES:
Nc1nc2c(cccc2s1)-c1ccc(CCC2CCNCC2)c(c1-c1nn[nH]n1)S(N)(=O)=O
: