Target
Metallo-beta-lactamase type 2
Ligand
BDBM262890
Substrate
Meas. Tech.
Class B Enzyme Assay
pH
7±n/a
IC50
0.901±n/a nM
Comments
extracted
Citation
 Mandal, MTang, HXiao, LSu, JLi, GYang, SPan, WTang, HDeJesus, RHicks, JLombardo, MChu, HHagmann, WPasternak, AGu, XJiang, JDong, SDing, FLondon, CBiswas, DYoung, KHunter, DNZhao, ZYang, D Metallo-beta-lactamase inhibitors US Patent  US9708336 Publication Date 7/18/2017 
Target
Name:
Metallo-beta-lactamase type 2
Synonyms:
B2 metallo-beta-lactamase BLAB_SERMA IMP-1 | Metallo-beta-lactamase type II
Type:
undefined
Mol. Mass.:
27125.88
Organism:
Serratia marcescens
Description:
P52699
Residue:
246
  
Inhibitor
Name:
BDBM262890
Synonyms:
3-(2-amino-4-fluoro-1,3- benzothiazol-6-yl)-2-(1H- tetrazol-5-yl)-6- (trifluoromethyl)benzenesulfon- amide | US9708336, 743
Type:
Small organic molecule
Emp. Form.:
C15H9F4N7O2S2
Mol. Mass.:
459.401
SMILES:
Nc1nc2c(F)cc(cc2s1)-c1ccc(c(c1-c1nnn[nH]1)S(N)(=O)=O)C(F)(F)F
: