Target
Tyrosine-protein kinase JAK3
Ligand
BDBM26198
Substrate
Biotinylated peptide substrate
Meas. Tech.
JAK3 Inhibition Assay
pH
7.5±n/a
Temperature
295.15±n/a K
IC50
5±n/a nM
Citation
 Chen, XWilson, LJMalaviya, RArgentieri, RLYang, SM Virtual screening to successfully identify novel janus kinase 3 inhibitors: a sequential focused screening approach. J Med Chem 51:7015-9 (2008)  
Target
Name:
Tyrosine-protein kinase JAK3
Synonyms:
JAK-3 JAK3_HUMAN Janus kinase 3 (JAK3) L-JAK | Leukocyte janus kinase
Type:
Protein
Mol. Mass.:
125111.08
Organism:
Homo sapiens (Human)
Description:
P52333
Residue:
1124
  
Inhibitor
Name:
BDBM26198
Synonyms:
4-tert-butyl-15-fluoro-3,5,10-triazatetracyclo[11.4.0.0^{2,6}.0^{7,12}]heptadeca-1(13),2(6),3,7(12),8,14,16-heptaen-11-one Compound # 2 PDK1 inhibitor, 1 | Tetracyclic Pyridone, 1
Type:
Small organic molecule
Emp. Form.:
C18H16FN3O
Mol. Mass.:
309.3375
SMILES:
CC(C)(C)c1nc2c([nH]1)c1ccc(F)cc1c1c2cc[nH]c1=O
:
Substrate
Name:
Biotinylated peptide substrate
Synonyms:
Type:
Peptide
Mol. Mass.:
358.43
Organism:
Description:
Residue:
3
NA