Target
Complement factor D
Ligand
BDBM354239
Substrate
Meas. Tech.
Human Factor D Assay
IC50
<1000±n/a nM
Citation
 Wiles, JAPhadke, ASDeshpande, MAgarwal, AChen, DGadhachanda, VRHashimoto, APais, GWang, QWang, X Aryl, heteroaryl, and heterocyclic compounds for treatment of medical disorders US Patent  US10287301 Publication Date 5/14/2019 
Target
Name:
Complement factor D
Synonyms:
Adipsin CFAD_HUMAN DF Properdin factor D
Type:
Protein
Mol. Mass.:
27039.19
Organism:
Homo sapiens (Human)
Description:
P00746
Residue:
253
  
Inhibitor
Name:
BDBM354239
Synonyms:
(2S,4R)-1-(2-(3-acetyl- 5-(2- methoxypyrimidin-5- yl)-1H-indol-1- yl)acetyl)-N-(3-chloro- 2-fluorobenzyl)-4- fluoropyrrolidine-2- carboxamide US10822352, Comp No. 136 | US9796741, cmp No. 136
Type:
Small organic molecule
Emp. Form.:
C29H26ClF2N5O4
Mol. Mass.:
581.998
SMILES:
COc1ncc(cn1)-c1ccc2n(CC(=O)N3C[C@H](F)C[C@H]3C(=O)NCc3cccc(Cl)c3F)cc(C(C)=O)c2c1
: