Target
Prothrombin
Ligand
BDBM387054
Substrate
Meas. Tech.
In Vitro Assay
Ki
>1000±n/a nM
Citation
 Ding, ZLai, GChen, SYan, X Hydrazine compound as blood coagulation factor Xa inhibitor US Patent  US9938272 Publication Date 4/10/2018 
Target
Name:
Prothrombin
Synonyms:
Activation peptide fragment 1 Coagulation factor II Prothrombin precursor Thrombin heavy chain | Thrombin light chain
Type:
Protein
Mol. Mass.:
70029.57
Organism:
Homo sapiens (Human)
Description:
P00734
Residue:
622
  
Inhibitor
Name:
BDBM387054
Synonyms:
1-(4-Methoxyphenyl)-6-(1-(2-oxopyrrolidin-1-yl)piperidin-4-yl)-3-(trifluoromethyl)-5,6-dihydro-1H-pyrazolo[3,4-c]pyridin-7(4H)-one | US9938272, Example 3
Type:
Small organic molecule
Emp. Form.:
C23H26F3N5O3
Mol. Mass.:
477.4794
SMILES:
COc1ccc(cc1)-n1nc(c2CCN(C3CCN(CC3)N3CCCC3=O)C(=O)c12)C(F)(F)F
: