Target
Serine protease 1
Ligand
BDBM387054
Substrate
Meas. Tech.
In Vitro Assay
Ki
>1000±n/a nM
Citation
 Ding, ZLai, GChen, SYan, X Hydrazine compound as blood coagulation factor Xa inhibitor US Patent  US9938272 Publication Date 4/10/2018 
Target
Name:
Serine protease 1
Synonyms:
Alpha-trypsin chain 1 Beta-trypsin PRSS1 TRP1 TRY1_HUMAN Thrombin & trypsin Trypsin I | Trypsin-1
Type:
Enzyme
Mol. Mass.:
26557.80
Organism:
Homo sapiens (Human)
Description:
P07477
Residue:
247
  
Inhibitor
Name:
BDBM387054
Synonyms:
1-(4-Methoxyphenyl)-6-(1-(2-oxopyrrolidin-1-yl)piperidin-4-yl)-3-(trifluoromethyl)-5,6-dihydro-1H-pyrazolo[3,4-c]pyridin-7(4H)-one | US9938272, Example 3
Type:
Small organic molecule
Emp. Form.:
C23H26F3N5O3
Mol. Mass.:
477.4794
SMILES:
COc1ccc(cc1)-n1nc(c2CCN(C3CCN(CC3)N3CCCC3=O)C(=O)c12)C(F)(F)F
: