Target
Coagulation factor V/Coagulation factor X/Serine/threonine-protein kinase BRSK2
Ligand
BDBM387054
Substrate
Meas. Tech.
In Vitro Assay
Ki
<10±n/a nM
Citation
 Ding, ZLai, GChen, SYan, X Hydrazine compound as blood coagulation factor Xa inhibitor US Patent  US9938272 Publication Date 4/10/2018 
Target
Name:
Coagulation factor V/Coagulation factor X/Serine/threonine-protein kinase BRSK2
Synonyms:
prothrombinase
Type:
Protein
Mol. Mass.:
Description:
Components:
This complex has 3 components.
Component 1
Name:
Coagulation factor X
Synonyms:
Activated coagulation factor X (FXa) Coagulation factor X precursor F10 Factor X heavy chain Factor Xa Stuart-Prower factor
Type:
Enzyme
Mol. Mass.:
54726.60
Organism:
Homo sapiens (Human)
Description:
Residue:
488
  
Component 2
Name:
Coagulation factor V
Synonyms:
Activated protein C cofactor Coagulation factor V light chain FA5_HUMAN | Proaccelerin, labile factor
Type:
PROTEIN
Mol. Mass.:
251677.76
Organism:
Homo sapiens (Human)
Description:
ChEMBL_476655
Residue:
2224
  
Component 3
Name:
Serine/threonine-protein kinase BRSK2
Synonyms:
BR serine/threonine-protein kinase 2 BRSK2_HUMAN PEN11B STK29
Type:
PROTEIN
Mol. Mass.:
81657.07
Organism:
Homo sapiens (Human)
Description:
ChEMBL_586949
Residue:
736
  
Inhibitor
Name:
BDBM387054
Synonyms:
1-(4-Methoxyphenyl)-6-(1-(2-oxopyrrolidin-1-yl)piperidin-4-yl)-3-(trifluoromethyl)-5,6-dihydro-1H-pyrazolo[3,4-c]pyridin-7(4H)-one | US9938272, Example 3
Type:
Small organic molecule
Emp. Form.:
C23H26F3N5O3
Mol. Mass.:
477.4794
SMILES:
COc1ccc(cc1)-n1nc(c2CCN(C3CCN(CC3)N3CCCC3=O)C(=O)c12)C(F)(F)F
: