Target
Kallikrein-1
Ligand
BDBM263238
Substrate
Kallikrein 1
Meas. Tech.
Enzymatic Activity Assay
IC50
>10000±n/a nM
Citation
 Davie, RLEdwards, HJEvans, DMHodgson, STMiller, INovak, ARSmith, AJStocks, MJ Heterocyclic derivates US Patent  US9533987 Publication Date 1/3/2017 
Target
Name:
Kallikrein-1
Synonyms:
KLK1 Kallikrein 1 Kidney/pancreas/salivary gland kallikrein | Tissue kallikrein
Type:
Enzyme
Mol. Mass.:
28874.69
Organism:
Homo sapiens (Human)
Description:
P06870
Residue:
262
  
Inhibitor
Name:
BDBM263238
Synonyms:
5-amino-1-(4-pyrazol-1-ylmethyl-benzyl)-1h-pyrazole-4-carboxylic acid (1-amino-isoquinolin-6-ylmethyl)-amide | US9533987, example 23
Type:
Small organic molecule
Emp. Form.:
C25H24N8O
Mol. Mass.:
452.5111
SMILES:
Nc1nn(Cc2ccc(Cn3cccn3)cc2)cc1C(=O)NCc1ccc2c(N)nccc2c1
:
Substrate
Name:
Kallikrein-1
Synonyms:
KLK1 Kallikrein 1 Kidney/pancreas/salivary gland kallikrein | Tissue kallikrein
Type:
Enzyme
Mol. Mass.:
28874.69
Organism:
Homo sapiens (Human)
Description:
P06870
Residue:
262