Target
Macrophage colony-stimulating factor 1 receptor
Ligand
BDBM27908
Substrate
FMS Substrate Peptide
Meas. Tech.
FMS Enzyme Inhibition Assay
pH
7.5±n/a
Temperature
295.15±n/a K
IC50
2.2±n/a nM
Citation
 Huang, HHutta, DARinker, JMHu, HParsons, WHSchubert, CDesjarlais, RLCrysler, CSChaikin, MADonatelli, RRChen, YCheng, DZhou, ZYurkow, EManthey, CLPlayer, MR Pyrido[2,3-d]pyrimidin-5-ones: A Novel Class of Antiinflammatory Macrophage Colony-Stimulating Factor-1 Receptor Inhibitors (dagger). J Med Chem 52:1081-99 (2009)  
Target
Name:
Macrophage colony-stimulating factor 1 receptor
Synonyms:
CSF1R FMS Macrophage colony stimulating factor receptor Macrophage colony-stimulating factor 1 receptor (c-FMS) Proto-oncogene c-Fms c-fms | cFMS
Type:
Protein
Mol. Mass.:
107979.48
Organism:
Homo sapiens (Human)
Description:
P07333
Residue:
972
  
Inhibitor
Name:
BDBM27908
Synonyms:
2-[4-(4-{[8-(2,3-dihydro-1H-inden-5-yl)-6-(methoxycarbamoyl)-5-oxo-5H,8H-pyrido[2,3-d]pyrimidin-2-yl]amino}phenyl)piperidin-1-yl]acetic acid | Pyrido[2,3-d]pyrimidin-5-one, 36
Type:
Small organic molecule
Emp. Form.:
C31H32N6O5
Mol. Mass.:
568.623
SMILES:
CONC(=O)c1cn(-c2ccc3CCCc3c2)c2nc(Nc3ccc(cc3)C3CCN(CC(O)=O)CC3)ncc2c1=O
:
Substrate
Name:
Macrophage colony-stimulating factor 1 receptor [555-568]
Synonyms:
CSF1R FMS FMS Substrate Peptide (aa 555-568) | Macrophage colony-stimulating factor 1 receptor (CSF1R) or (c-fms)
Type:
Peptide
Mol. Mass.:
1619.64
Organism:
Homo sapiens (Human)
Description:
P07333 aa 555-568
Residue:
14
SYEGNSYTFIDPTQ