Target
NAD-dependent protein deacetylase sirtuin-2
Ligand
BDBM29059
Substrate
Fluor de Lys-SIRT2
Meas. Tech.
Enzyme Inhibition Assay
IC50
4800±n/a nM
Citation
 Medda, FRussell, RJHiggins, MMcCarthy, ARCampbell, JSlawin, AMLane, DPLain, SWestwood, NJ Novel cambinol analogs as sirtuin inhibitors: synthesis, biological evaluation, and rationalization of activity. J Med Chem 52:2673-82 (2009)  
Target
Name:
NAD-dependent protein deacetylase sirtuin-2
Synonyms:
NAD-Dependent Deacetylase Sirtuin-2 NAD-dependent deacetylase sirtuin 3 SIR2-like SIR2L SIR2_HUMAN Sirtuin 2 (SIRT2)
Type:
Hydrolase
Mol. Mass.:
43172.62
Organism:
Homo sapiens (Human)
Description:
Residue:
389
  
Inhibitor
Name:
BDBM29059
Synonyms:
cambinol analog, 6h
Type:
Small organic molecule
Emp. Form.:
C24H22N2O2S
Mol. Mass.:
402.509
SMILES:
CCCn1c(-c2ccccc2)c(Cc2c(O)ccc3ccccc23)c(=O)[nH]c1=S
:
Substrate
Name:
Fluor de Lys-SIRT2
Synonyms:
Type:
fluorogenic, acetylated peptide
Mol. Mass.:
1457.67
Organism:
Description:
Based on residues 317-320 of p53.
Residue:
13
GLNPRLYSLYSAC