Target
Metabotropic glutamate receptor 3
Ligand
BDBM393789
Substrate
Meas. Tech.
In Vitro GIRK Thallium Flux Assay (60 minutes)
EC50
1950±n/a nM
Citation
 Cosford, NDRaveendra-Panickar, DSheffler, DJ Metabotropic glutamate receptor negative allosteric modulators (NAMS) and uses thereof US Patent  US9969726 Publication Date 5/15/2018 
Target
Name:
Metabotropic glutamate receptor 3
Synonyms:
GRM3_RAT Grm3 glutamate receptor, metabotropic 3 precursor
Type:
Protein
Mol. Mass.:
98971.84
Organism:
Rattus norvegicus (Rat)
Description:
P31422
Residue:
879
  
Inhibitor
Name:
BDBM393789
Synonyms:
US10597367, Example 78 | US9969726, Example 78
Type:
Small organic molecule
Emp. Form.:
C24H12ClF6N3O2
Mol. Mass.:
523.814
SMILES:
OC(=O)c1ccc(c(Cl)c1)-c1cccc(c1)-c1nc(cc(n1)C(F)(F)F)-c1ccc(nc1)C(F)(F)F
: