Target
Interleukin-1 receptor-associated kinase 4
Ligand
BDBM394078
Substrate
Meas. Tech.
Kinase Assay
IC50
1.000±n/a nM
Citation
 Altman, MDAndresen, BMBrubaker, JDChilders, MLDonofrio, AFischmann, TGibeau, CRKattar, SDLesburg, CALim, JMacLean, JKMansoor, UFNorthrup, ABSanders, JMTorres, L Inhibitors of IRAK4 activity US Patent  US9969749 Publication Date 5/15/2018 
Target
Name:
Interleukin-1 receptor-associated kinase 4
Synonyms:
IRAK-4 IRAK4_HUMAN Interleukin-1 receptor-associated kinase 4 (IRAK4) | Renal carcinoma antigen NY-REN-64
Type:
Protein
Mol. Mass.:
51519.08
Organism:
Homo sapiens (Human)
Description:
Q9NWZ3
Residue:
460
  
Inhibitor
Name:
BDBM394078
Synonyms:
US9969749, Example 5-28 | cyclopropyl{4-[trans-4- ({6-[6-fluoro-5- (methylamino)pyridin-3- yl]quinazolin-4- yl}amino)cyclohexyl] piperazin-1-yl}methanone
Type:
Small organic molecule
Emp. Form.:
C28H34FN7O
Mol. Mass.:
503.6143
SMILES:
CNc1cc(cnc1F)-c1ccc2ncnc(N[C@H]3CC[C@@H](CC3)N3CCN(CC3)C(=O)C3CC3)c2c1
: