Target
Pantetheinase
Ligand
BDBM394648
Substrate
Meas. Tech.
Human Vanin-1 Enzyme Assay 2
IC50
9.80±n/a nM
Citation
 Casimiro-Garcia, ACondon, JSFlick, ACGopalsamy, AKirincich, SJMathias, JPStrobach, JWXiang, JSXing, LHWang, X Heterocyclic compounds as inhibitors of Vanin-1 enzyme US Patent  US10308615 Publication Date 6/4/2019 
Target
Name:
Pantetheinase
Synonyms:
Pantetheine hydrolase VNN1 Vanin-1 | Vascular non-inflammatory molecule 1
Type:
Enzyme Catalytic Domain
Mol. Mass.:
57002.46
Organism:
Homo sapiens (Human)
Description:
O95497
Residue:
513
  
Inhibitor
Name:
BDBM394648
Synonyms:
3-[(2-{[1-(pyrazin-2-yl)cyclopropyl]amino}pyrimidin-5-yl)carbonyl]benzonitrile | US10308615, Example 5
Type:
Small organic molecule
Emp. Form.:
C19H14N6O
Mol. Mass.:
342.3541
SMILES:
O=C(c1cnc(NC2(CC2)c2cnccn2)nc1)c1cccc(c1)C#N
: