Target
E3 ubiquitin-protein ligase Mdm2
Ligand
BDBM31196
Substrate
PMDM6-F Peptide
Meas. Tech.
Fluorescence Polarization-Based (FP-Based) Binding Assay
pH
7.5±n/a
Temperature
296.15±n/a K
Ki
86±20 nM
Citation
 Ding, KLu, YNikolovska-Coleska, ZWang, GQiu, SShangary, SGao, WQin, DStuckey, JKrajewski, KRoller, PPWang, S Structure-based design of spiro-oxindoles as potent, specific small-molecule inhibitors of the MDM2-p53 interaction. J Med Chem 49:3432-5 (2006)  
Target
Name:
E3 ubiquitin-protein ligase Mdm2
Synonyms:
Double minute 2 protein E3 ubiquitin-protein ligase Mdm2 (p53-binding protein Mdm2) Human Double Minute 2 (HDM2) MDM2-MDMX p53-Binding Protein MDM2 | p53-binding protein
Type:
Oncoprotein
Mol. Mass.:
55196.54
Organism:
Homo sapiens (Human)
Description:
Q00987
Residue:
491
  
Inhibitor
Name:
BDBM31196
Synonyms:
spiro-oxindole, 1
Type:
Small organic molecule
Emp. Form.:
C25H29Cl2N3O2
Mol. Mass.:
474.423
SMILES:
CN(C)C(=O)[C@@H]1N[C@H](CC(C)(C)C)[C@@]2([C@H]1c1cccc(Cl)c1)C(=O)Nc1cc(Cl)ccc21
:
Substrate
Name:
PMDM6-F Peptide
Synonyms:
Type:
Fluorescence probe
Mol. Mass.:
4802.47
Organism:
Description:
Residue:
45