Target
E3 ubiquitin-protein ligase Mdm2
Ligand
BDBM31197
Substrate
PMDM6-F Peptide
Meas. Tech.
Fluorescence Polarization-Based (FP-Based) Binding Assay
pH
7.5±n/a
Temperature
296.15±n/a K
Ki
36±9 nM
Citation
 Ding, KLu, YNikolovska-Coleska, ZWang, GQiu, SShangary, SGao, WQin, DStuckey, JKrajewski, KRoller, PPWang, S Structure-based design of spiro-oxindoles as potent, specific small-molecule inhibitors of the MDM2-p53 interaction. J Med Chem 49:3432-5 (2006)  
Target
Name:
E3 ubiquitin-protein ligase Mdm2
Synonyms:
Double minute 2 protein E3 ubiquitin-protein ligase Mdm2 (p53-binding protein Mdm2) Human Double Minute 2 (HDM2) MDM2-MDMX p53-Binding Protein MDM2 | p53-binding protein
Type:
Oncoprotein
Mol. Mass.:
55196.54
Organism:
Homo sapiens (Human)
Description:
Q00987
Residue:
491
  
Inhibitor
Name:
BDBM31197
Synonyms:
CHEMBL211045 med.21724, Compound 186
Type:
Small organic molecule
Emp. Form.:
C30H30Cl2N4O4
Mol. Mass.:
581.49
SMILES:
COc1ccc(C2=NC(C(N2C(=O)N2CCNC(=O)C2)c2ccc(Cl)cc2)c2ccc(Cl)cc2)c(OC(C)C)c1
:
Substrate
Name:
PMDM6-F Peptide
Synonyms:
Type:
Fluorescence probe
Mol. Mass.:
4802.47
Organism:
Description:
Residue:
45