Target
E3 ubiquitin-protein ligase Mdm2
Ligand
BDBM31204
Substrate
PMDM6-F Peptide
Meas. Tech.
Fluorescence Polarization-Based (FP-Based) Binding Assay
pH
7.5±n/a
Temperature
296.15±n/a K
Ki
39±5 nM
Citation
 Ding, KLu, YNikolovska-Coleska, ZWang, GQiu, SShangary, SGao, WQin, DStuckey, JKrajewski, KRoller, PPWang, S Structure-based design of spiro-oxindoles as potent, specific small-molecule inhibitors of the MDM2-p53 interaction. J Med Chem 49:3432-5 (2006)  
Target
Name:
E3 ubiquitin-protein ligase Mdm2
Synonyms:
Double minute 2 protein E3 ubiquitin-protein ligase Mdm2 (p53-binding protein Mdm2) Human Double Minute 2 (HDM2) MDM2-MDMX p53-Binding Protein MDM2 | p53-binding protein
Type:
Oncoprotein
Mol. Mass.:
55196.54
Organism:
Homo sapiens (Human)
Description:
Q00987
Residue:
491
  
Inhibitor
Name:
BDBM31204
Synonyms:
spiro-oxindole, 10
Type:
Small organic molecule
Emp. Form.:
C30H37Cl2FN4O2
Mol. Mass.:
575.545
SMILES:
CC(C)(C)C[C@H]1N[C@H]([C@H](c2cccc(Cl)c2F)[C@@]11C(=O)Nc2cc(Cl)ccc12)C(=O)NCCN1CCCCC1
:
Substrate
Name:
PMDM6-F Peptide
Synonyms:
Type:
Fluorescence probe
Mol. Mass.:
4802.47
Organism:
Description:
Residue:
45