Target
cAMP-specific 3',5'-cyclic phosphodiesterase 4C
Ligand
BDBM399927
Substrate
Meas. Tech.
cintillation Proximity Assay (SPA)
IC50
31.4±n/a nM
Citation
 Chappie, TAPatel, NCVerhoest, PRHelal, CJSciabola, SLaChapelle, EAWager, TTHayward, MM 6,7-dihydro-5H-pyrazolo[5,1-b][1,3]oxazine-2-carboxamide compounds US Patent  US10323042 Publication Date 6/18/2019 
Target
Name:
cAMP-specific 3',5'-cyclic phosphodiesterase 4C
Synonyms:
3',5'-cyclic phosphodiesterase NP_000914.2 PDE4C | PDE4C1
Type:
Enzyme Catalytic Domain
Mol. Mass.:
79875.54
Organism:
Homo sapiens (Human)
Description:
Q08493
Residue:
712
  
Inhibitor
Name:
BDBM399927
Synonyms:
(6S)-3-(4-Chloro-2,5-difluorophenyl)-N-cyclopropyl-6-fluoro-6,7-dihydro-5H-pyrazolo[5,1-b][1,3]oxazine-2-carboxamide US10738063, Example 7
Type:
Small organic molecule
Emp. Form.:
C16H13ClF3N3O2
Mol. Mass.:
371.742
SMILES:
F[C@@H]1COc2c(c(nn2C1)C(=O)NC1CC1)-c1cc(F)c(Cl)cc1F
: