Target
Isoform 7 of cAMP-specific 3',5'-cyclic phosphodiesterase 4A (PDE4A8)
Ligand
BDBM399928
Substrate
Meas. Tech.
cintillation Proximity Assay (SPA)
IC50
5.29±n/a nM
Citation
 Chappie, TAPatel, NCVerhoest, PRHelal, CJSciabola, SLaChapelle, EAWager, TTHayward, MM 6,7-dihydro-5H-pyrazolo[5,1-b][1,3]oxazine-2-carboxamide compounds US Patent  US10323042 Publication Date 6/18/2019 
Target
Name:
Isoform 7 of cAMP-specific 3',5'-cyclic phosphodiesterase 4A (PDE4A8)
Synonyms:
DPDE2 PDE4A PDE4A_HUMAN cAMP-specific 3',5'-cyclic phosphodiesterase 4A isoform 3
Type:
Enzyme Catalytic Domain
Mol. Mass.:
91289.34
Organism:
Homo sapiens (Human)
Description:
P27815-7
Residue:
825
  
Inhibitor
Name:
BDBM399928
Synonyms:
3-(4-Chloro-2-methylphenyl)-N-cyclopropyl-6,6-difluoro-6,7-dihydro-5H-pyrazolo[5,1-b][1,3]oxazine-2-carboxamide US10738063, Example 8
Type:
Small organic molecule
Emp. Form.:
C17H16ClF2N3O2
Mol. Mass.:
367.778
SMILES:
Cc1cc(Cl)ccc1-c1c2OCC(F)(F)Cn2nc1C(=O)NC1CC1
: