Target
cAMP-specific 3',5'-cyclic phosphodiesterase 4B
Ligand
BDBM399933
Substrate
Meas. Tech.
cintillation Proximity Assay (SPA)
IC50
57.0±n/a nM
Citation
 Chappie, TAPatel, NCVerhoest, PRHelal, CJSciabola, SLaChapelle, EAWager, TTHayward, MM 6,7-dihydro-5H-pyrazolo[5,1-b][1,3]oxazine-2-carboxamide compounds US Patent  US10323042 Publication Date 6/18/2019 
Target
Name:
cAMP-specific 3',5'-cyclic phosphodiesterase 4B
Synonyms:
3',5'-cyclic phosphodiesterase Isoform PDE4B1 PDE4B PDE4B_HUMAN Phosphodiesterase 4B (PDE4B) Phosphodiesterase Type 4 (PDE4B)
Type:
Protein
Mol. Mass.:
83318.87
Organism:
Homo sapiens (Human)
Description:
Q07343
Residue:
736
  
Inhibitor
Name:
BDBM399933
Synonyms:
US10323042, Example 13 | US10738063, Example 13
Type:
Small organic molecule
Emp. Form.:
C16H15ClFN3O2
Mol. Mass.:
335.761
SMILES:
Fc1cc(ccc1Cl)-c1c2OCCCn2nc1C(=O)NC1CC1
: