Target
cAMP-specific 3',5'-cyclic phosphodiesterase 4C
Ligand
BDBM399968
Substrate
Meas. Tech.
cintillation Proximity Assay (SPA)
IC50
63.8±n/a nM
Citation
 Chappie, TAPatel, NCVerhoest, PRHelal, CJSciabola, SLaChapelle, EAWager, TTHayward, MM 6,7-dihydro-5H-pyrazolo[5,1-b][1,3]oxazine-2-carboxamide compounds US Patent  US10323042 Publication Date 6/18/2019 
Target
Name:
cAMP-specific 3',5'-cyclic phosphodiesterase 4C
Synonyms:
3',5'-cyclic phosphodiesterase NP_000914.2 PDE4C | PDE4C1
Type:
Enzyme Catalytic Domain
Mol. Mass.:
79875.54
Organism:
Homo sapiens (Human)
Description:
Q08493
Residue:
712
  
Inhibitor
Name:
BDBM399968
Synonyms:
US10323042, Example 48 | US10738063, Example 48
Type:
Small organic molecule
Emp. Form.:
C17H17ClFN3O2
Mol. Mass.:
349.787
SMILES:
Cc1cc(Cl)c(F)cc1-c1c2OCCCn2nc1C(=O)N1CCC1
: