Target
Isoform 7 of cAMP-specific 3',5'-cyclic phosphodiesterase 4A (PDE4A8)
Ligand
BDBM399973
Substrate
Meas. Tech.
cintillation Proximity Assay (SPA)
IC50
5.35±n/a nM
Citation
 Chappie, TAPatel, NCVerhoest, PRHelal, CJSciabola, SLaChapelle, EAWager, TTHayward, MM 6,7-dihydro-5H-pyrazolo[5,1-b][1,3]oxazine-2-carboxamide compounds US Patent  US10323042 Publication Date 6/18/2019 
Target
Name:
Isoform 7 of cAMP-specific 3',5'-cyclic phosphodiesterase 4A (PDE4A8)
Synonyms:
DPDE2 PDE4A PDE4A_HUMAN cAMP-specific 3',5'-cyclic phosphodiesterase 4A isoform 3
Type:
Enzyme Catalytic Domain
Mol. Mass.:
91289.34
Organism:
Homo sapiens (Human)
Description:
P27815-7
Residue:
825
  
Inhibitor
Name:
BDBM399973
Synonyms:
US10323042, Example 53A US10738063, Example 53B
Type:
Small organic molecule
Emp. Form.:
C18H16F2N4O2
Mol. Mass.:
358.342
SMILES:
Cc1cc(C#N)c(F)cc1-c1c(nn2C[C@H](F)COc12)C(=O)NC1CC1
: