Target
cAMP-specific 3',5'-cyclic phosphodiesterase 4B
Ligand
BDBM399978
Substrate
Meas. Tech.
cintillation Proximity Assay (SPA)
IC50
5.66±n/a nM
Citation
 Chappie, TAPatel, NCVerhoest, PRHelal, CJSciabola, SLaChapelle, EAWager, TTHayward, MM 6,7-dihydro-5H-pyrazolo[5,1-b][1,3]oxazine-2-carboxamide compounds US Patent  US10323042 Publication Date 6/18/2019 
Target
Name:
cAMP-specific 3',5'-cyclic phosphodiesterase 4B
Synonyms:
3',5'-cyclic phosphodiesterase Isoform PDE4B1 PDE4B PDE4B_HUMAN Phosphodiesterase 4B (PDE4B) Phosphodiesterase Type 4 (PDE4B)
Type:
Protein
Mol. Mass.:
83318.87
Organism:
Homo sapiens (Human)
Description:
Q07343
Residue:
736
  
Inhibitor
Name:
BDBM399978
Synonyms:
US10323042, Example 57 | US10738063, Example 57
Type:
Small organic molecule
Emp. Form.:
C17H16ClF2N3O2
Mol. Mass.:
367.778
SMILES:
Cc1cc(Cl)c(F)cc1-c1c(nn2C[C@H](F)COc12)C(=O)NC1CC1
: