Target
cAMP-specific 3',5'-cyclic phosphodiesterase 4C
Ligand
BDBM399979
Substrate
Meas. Tech.
cintillation Proximity Assay (SPA)
IC50
16.4±n/a nM
Citation
 Chappie, TAPatel, NCVerhoest, PRHelal, CJSciabola, SLaChapelle, EAWager, TTHayward, MM 6,7-dihydro-5H-pyrazolo[5,1-b][1,3]oxazine-2-carboxamide compounds US Patent  US10323042 Publication Date 6/18/2019 
Target
Name:
cAMP-specific 3',5'-cyclic phosphodiesterase 4C
Synonyms:
3',5'-cyclic phosphodiesterase NP_000914.2 PDE4C | PDE4C1
Type:
Enzyme Catalytic Domain
Mol. Mass.:
79875.54
Organism:
Homo sapiens (Human)
Description:
Q08493
Residue:
712
  
Inhibitor
Name:
BDBM399979
Synonyms:
US10323042, Example 58
Type:
Small organic molecule
Emp. Form.:
C16H12ClF4N3O2
Mol. Mass.:
389.732
SMILES:
Fc1cc(-c2c3OCC(F)(F)Cn3nc2C(=O)NC2CC2)c(F)cc1Cl
: