Target
Coagulation factor X
Ligand
BDBM35299
Substrate
BDBM12658
Meas. Tech.
Enzyme Inhibition Assay
pH
7.4±n/a
Temperature
295.15±n/a K
IC50
3±n/a nM
Citation
 Shi, YLi, CO'Connor, SPZhang, JShi, MBisaha, SNWang, YSitkoff, DPudzianowski, ATHuang, CKlei, HEKish, KYanchunas, JLiu, ECHartl, KSSeiler, SMSteinbacher, TESchumacher, WAAtwal, KSStein, PD Aroylguanidine-based factor Xa inhibitors: the discovery of BMS-344577. Bioorg Med Chem Lett 19:6882-9 (2009)  
Target
Name:
Coagulation factor X
Synonyms:
Activated coagulation factor X (FXa) Coagulation factor X precursor F10 Factor X heavy chain Factor Xa Stuart-Prower factor
Type:
Enzyme
Mol. Mass.:
54726.60
Organism:
Homo sapiens (Human)
Description:
Residue:
488
  
Inhibitor
Name:
BDBM35299
Synonyms:
benzoylguanidine, 19
Type:
Small organic molecule
Emp. Form.:
C30H34N6O6
Mol. Mass.:
574.6276
SMILES:
Cc1cc2cc(ccc2o1)N=C(N[C@H]1CCCCN(CC(=O)N2CCCC2)C1=O)NC(=O)c1ccc(cc1)C(=O)ON
:
Substrate
Name:
BDBM12658
Synonyms:
4-[({[(1S)-4-carbamimidamido-1-[(4-nitrophenyl)carbamoyl]butyl]carbamoyl}methyl)carbamoyl]-4-[(2S,3S)-3-methyl-2-(phenylformamido)pentanamido]butanoic acid hydrochloride Chromogenic Substrate S-2222 benzoyl-Ile-Glu-Gly-Arg-p-nitroanilide
Type:
Small organic molecule
Emp. Form.:
C32H43N9O9
Mol. Mass.:
697.7387
SMILES:
[#6]-[#6]-[#6@H](-[#6])-[#6@H](-[#7]-[#6](=O)-c1ccccc1)-[#6](=O)-[#7]-[#6@@H](-[#6]-[#6]-[#6](-[#8])=O)-[#6](=O)-[#7]-[#6]-[#6](=O)-[#7]-[#6@@H](-[#6]-[#6]-[#6]\[#7]=[#6](\[#7])-[#7])-[#6](=O)-[#7]-c1ccc(cc1)-[#7+](-[#8-])=O
: