Target
Interleukin-1 receptor-associated kinase 4
Ligand
BDBM50095472
Substrate
Meas. Tech.
IRAK4 Kinase Assay
IC50
6.00±n/a nM
Citation
 Lim, JAltman, MDBrubaker, JDGibeau, CR Pyrazolopyrimidine inhibitors of IRAK4 activity US Patent  US10329294 Publication Date 6/25/2019 
Target
Name:
Interleukin-1 receptor-associated kinase 4
Synonyms:
IRAK-4 IRAK4_HUMAN Interleukin-1 receptor-associated kinase 4 (IRAK4) | Renal carcinoma antigen NY-REN-64
Type:
Protein
Mol. Mass.:
51519.08
Organism:
Homo sapiens (Human)
Description:
Q9NWZ3
Residue:
460
  
Inhibitor
Name:
BDBM50095472
Synonyms:
CHEMBL3590476 | US10329294, Example 280
Type:
Small organic molecule
Emp. Form.:
C19H26N8O2
Mol. Mass.:
398.4621
SMILES:
COCc1nn(C)cc1NC(=O)c1cnn2ccc(N[C@@H]3CCCC[C@@H]3N)nc12
: