Target
Interleukin-1 receptor-associated kinase 4
Ligand
BDBM402801
Substrate
Meas. Tech.
IRAK4 Kinase Assay
IC50
117±n/a nM
Citation
 Lim, JAltman, MDBrubaker, JDGibeau, CR Pyrrolotriazine inhibitors of IRAK4 activity US Patent  US10329295 Publication Date 6/25/2019 
Target
Name:
Interleukin-1 receptor-associated kinase 4
Synonyms:
IRAK-4 IRAK4_HUMAN Interleukin-1 receptor-associated kinase 4 (IRAK4) | Renal carcinoma antigen NY-REN-64
Type:
Protein
Mol. Mass.:
51519.08
Organism:
Homo sapiens (Human)
Description:
Q9NWZ3
Residue:
460
  
Inhibitor
Name:
BDBM402801
Synonyms:
N-(3-cyano-1-methyl-1H- pyrazol-4-yl)-2-(3,8- diazabicyclo[3.2.1]oct-3- yl)pyrrolo[2,1- f][1,2,4]triazine-7- carboxamide trifluoroacetate | US10329295, Example 110
Type:
Small organic molecule
Emp. Form.:
C18H19N9O
Mol. Mass.:
377.4032
SMILES:
Cn1cc(NC(=O)c2ccc3cnc(nn23)N2CC3CCC(C2)N3)c(n1)C#N
: