Target
Beta-secretase 1
Ligand
BDBM195108
Substrate
Meas. Tech.
BACE Assay
IC50
42.5±n/a nM
Citation
 Cacatian, SClaremon, DADillard, LWFuchs, KHeine, NJia, LLeftheris, KMcKeever, BMorales-Ramos, ASingh, SBVenkatraman, SWu, GWu, ZXu, ZYuan, JZheng, Y Inhibitors of beta-secretase US Patent  US10336717 Publication Date 7/2/2019 
Target
Name:
Beta-secretase 1
Synonyms:
ASP2 Aspartyl protease 2 BACE1 Beta-secretase (BACE) Beta-secretase 1 (BACE 1) Beta-secretase 1 (BACE1) Beta-site amyloid precursor protein cleaving enzyme 1 Memapsin-2 beta-Secretase (BACE-1) | beta-Secretase (BACE1)
Type:
Protein
Mol. Mass.:
55755.10
Organism:
Homo sapiens (Human)
Description:
P56817
Residue:
501
  
Inhibitor
Name:
BDBM195108
Synonyms:
US10336717, Compound 167 | US9212153, 167,Ex. 129
Type:
Small organic molecule
Emp. Form.:
C28H36N4O2
Mol. Mass.:
460.611
SMILES:
CCCc1cncc(c1)-c1ccc2CC3(CCC(CC3)OC)C3(N=C(N)N(C(C)C)C3=O)c2c1
: