Target
Beta-secretase 1
Ligand
BDBM195388
Substrate
Meas. Tech.
BACE Assay
IC50
870±n/a nM
Citation
 Cacatian, SClaremon, DADillard, LWFuchs, KHeine, NJia, LLeftheris, KMcKeever, BMorales-Ramos, ASingh, SBVenkatraman, SWu, GWu, ZXu, ZYuan, JZheng, Y Inhibitors of beta-secretase US Patent  US10336717 Publication Date 7/2/2019 
Target
Name:
Beta-secretase 1
Synonyms:
ASP2 Aspartyl protease 2 BACE1 Beta-secretase (BACE) Beta-secretase 1 (BACE 1) Beta-secretase 1 (BACE1) Beta-site amyloid precursor protein cleaving enzyme 1 Memapsin-2 beta-Secretase (BACE-1) | beta-Secretase (BACE1)
Type:
Protein
Mol. Mass.:
55755.10
Organism:
Homo sapiens (Human)
Description:
P56817
Residue:
501
  
Inhibitor
Name:
BDBM195388
Synonyms:
US10336717, Compound 471 | US9212153, 471,Ex. 405
Type:
Small organic molecule
Emp. Form.:
C25H20N6O
Mol. Mass.:
420.4659
SMILES:
CN1C(N)=NC2(C1=O)c1cc(ccc1CC21Cc2cnncc2C1)-c1cccc(c1)C#N
: