Target
Heat shock protein HSP 90-alpha
Ligand
BDBM265407
Substrate
Meas. Tech.
Malachite Green ATPase assay
IC50
<10000±n/a nM
Citation
 Drysdale, MJDymock, BWFinch, HWebb, PMcDonald, EJames, KECheung, KMMatthews, TP Isoxazole compounds as inhibitors of heat shock proteins US Patent  US9718793 Publication Date 8/1/2017 
Target
Name:
Heat shock protein HSP 90-alpha
Synonyms:
HS90A_HUMAN HSP86 HSP90AA1 HSPCA Heat shock 86 kDa Heat shock protein HSP 90-alpha (HSP90) LAP-2 Lipopolysaccharide-associated protein 2 heat shock protein 90kDa alpha (cytosolic), class A member 1 isoform 2
Type:
Molecular Chaperone
Mol. Mass.:
84623.45
Organism:
Homo sapiens (Human)
Description:
P07900
Residue:
732
  
Inhibitor
Name:
BDBM265407
Synonyms:
US10413550, Example 78y US9718793, 78y
Type:
Small organic molecule
Emp. Form.:
C28H35N3O4
Mol. Mass.:
477.5952
SMILES:
CC(C)NC(=O)c1noc(c1-c1ccc(CNC2CCCC2)cc1)-c1cc(C(C)C)c(O)cc1O
: