Target
Multidrug resistance-associated protein 1
Ligand
BDBM44570
Substrate
Meas. Tech.
Identification of Molecular Probes that Activate MRP-1 - Dose Response
EC50
6953±n/a nM
Citation
 PubChem, PC Identification of Molecular Probes that Activate MRP-1 - Dose Response PubChem Bioassay (2007)[AID] 
Target
Name:
Multidrug resistance-associated protein 1
Synonyms:
7.6.2.2 ABCC1 ATP-binding cassette, sub-family C, member 1 isoform 1 LTC4 transporter MRP MRP1_HUMAN
Type:
Mol. Mass.:
171597.72
Organism:
Homo sapiens (Human)
Description:
P33527
Residue:
1531
  
Inhibitor
Name:
BDBM44570
Synonyms:
2-[5-(4-Chloro-phenoxymethyl)-4-(2-methoxy-ethyl)-4H-[1,2,4]triazol-3-ylsulfanyl]-N-methyl-acetamide 2-[[5-[(4-chlorophenoxy)methyl]-4-(2-methoxyethyl)-1,2,4-triazol-3-yl]sulfanyl]-N-methylacetamide 2-[[5-[(4-chlorophenoxy)methyl]-4-(2-methoxyethyl)-1,2,4-triazol-3-yl]thio]-N-methylacetamide SMR000002801 | cid_651027
Type:
Small organic molecule
Emp. Form.:
C15H19ClN4O3S
Mol. Mass.:
370.854
SMILES:
CNC(=O)CSc1nnc(COc2ccc(Cl)cc2)n1CCOC
: