Target
Multidrug resistance-associated protein 1
Ligand
BDBM44662
Substrate
Meas. Tech.
Identification of Molecular Probes that Activate MRP-1 - Dose Response
EC50
2998±n/a nM
Citation
 PubChem, PC Identification of Molecular Probes that Activate MRP-1 - Dose Response PubChem Bioassay (2007)[AID] 
Target
Name:
Multidrug resistance-associated protein 1
Synonyms:
7.6.2.2 ABCC1 ATP-binding cassette, sub-family C, member 1 isoform 1 LTC4 transporter MRP MRP1_HUMAN
Type:
Mol. Mass.:
171597.72
Organism:
Homo sapiens (Human)
Description:
P33527
Residue:
1531
  
Inhibitor
Name:
BDBM44662
Synonyms:
MLS000086493 N-(6-methyl-1,3-benzothiazol-2-yl)-3-(thiophen-2-ylsulfonylamino)propanamide SMR000022388 | cid_3244130
Type:
Small organic molecule
Emp. Form.:
C15H15N3O3S3
Mol. Mass.:
381.493
SMILES:
Cc1ccc2nc(NC(=O)CCNS(=O)(=O)c3cccs3)sc2c1
: