Target
Lysine-specific demethylase 4C
Ligand
BDBM270513
Substrate
Meas. Tech.
JMJD2C Assay
IC50
5500±n/a nM
Citation
 Chen, YKWallace, MB Histone demethylase inhibitors US Patent  US10059687 Publication Date 8/28/2018 
Target
Name:
Lysine-specific demethylase 4C
Synonyms:
GASC-1 protein Gene amplified in squamous cell carcinoma 1 protein JMJD2C Jumonji domain-containing protein 2C KDM4C_HUMAN | KIAA0780
Type:
Protein
Mol. Mass.:
119979.01
Organism:
Homo sapiens (Human)
Description:
Q9H3R0
Residue:
1056
  
Inhibitor
Name:
BDBM270513
Synonyms:
(S)-3-(((6-((4-ethylphenyl)(methyl)amino)-1,2,3,4-tetra-hydroisoquinolin-1-yl)methyl)amino)isonicotinic acid. US11001568, Example 10B
Type:
Small organic molecule
Emp. Form.:
C25H28N4O2
Mol. Mass.:
416.5154
SMILES:
CCc1ccc(cc1)N(C)c1ccc2[C@@H](CNc3cnccc3C(O)=O)NCCc2c1
: