Target
Lysine-specific demethylase 5B
Ligand
BDBM270534
Substrate
Meas. Tech.
Jarid1B Assay
IC50
<100±n/a nM
Citation
 Chen, YKWallace, MB Histone demethylase inhibitors US Patent  US10059687 Publication Date 8/28/2018 
Target
Name:
Lysine-specific demethylase 5B
Synonyms:
CT31 Histone demethylase JARID1B Jumonji/ARID domain-containing protein 1B KDM5B_HUMAN Lysine-specific demethylase 5B (KDM5Flag-5B-FL) PLU1 RBP2-H1 | Retinoblastoma-binding protein 2 homolog 1
Type:
Protein
Mol. Mass.:
175659.67
Organism:
Homo sapiens (Human)
Description:
Q9UGL1
Residue:
1544
  
Inhibitor
Name:
BDBM270534
Synonyms:
(R)-3-(((2-methyl-5-(o-tolyl)isoindolin-1-yl)methyl)amino) isonicotinic acid US11001568, Example 21A | US11731954, Example 21A and 21B
Type:
Small organic molecule
Emp. Form.:
C23H23N3O2
Mol. Mass.:
373.4476
SMILES:
CN1Cc2cc(ccc2[C@@H]1CNc1cnccc1C(O)=O)-c1ccccc1C
: