Target
Orexin/Hypocretin receptor type 1
Ligand
BDBM404298
Substrate
Meas. Tech.
FLIPR Ca2+ Flux Assay
IC50
>10000±n/a nM
Citation
 Liverton, NKuduk, SDBeshore, DLuo, YMeng, NYu, T Piperidine isoxazole and isothiazole orexin receptor antagonists US Patent  US10017504 Publication Date 7/10/2018 
Target
Name:
Orexin/Hypocretin receptor type 1
Synonyms:
HCRTR1 OX1R_HUMAN Orexin receptor type 1 (OR 1) Orexin receptor type 1 (OX1) Orexin receptor type 1 (OxR1) | Ox1r
Type:
Protein
Mol. Mass.:
47554.50
Organism:
Homo sapiens (Human)
Description:
O43613
Residue:
425
  
Inhibitor
Name:
BDBM404298
Synonyms:
2-(5-{(3R,6R)-1-[(2- Ethoxyphenyl)carbonyl]-6- methylpiperidin-3-yl}isoxazol-3- yl)propan-2-ol | US10017504, 31
Type:
Small organic molecule
Emp. Form.:
C21H28N2O4
Mol. Mass.:
372.458
SMILES:
CCOc1ccccc1C(=O)N1C[C@@H](CC[C@H]1C)c1cc(no1)C(C)(C)O
: