Target
Nicotinamide phosphoribosyltransferase
Ligand
BDBM81392
Substrate
Meas. Tech.
In Vitro Inhibition Assay
IC50
74±2.1 nM
Citation
 Fleischer, TCMurphy, BRFlick, JSTerry-Lorenzo, RTGao, ZHDavis, TMcKinnon, ROstanin, KWillardsen, JABoniface, JJ Chemical proteomics identifies Nampt as the target of CB30865, an orphan cytotoxic compound. Chem Biol 17:659-64 (2010)  
Target
Name:
Nicotinamide phosphoribosyltransferase
Synonyms:
NAMPT NAmPRTase Nicotinamide phosphoribosyltransferase (NAMPT) PBEF1 | Pre-B-cell colony-enhancing factor 1
Type:
Enzyme
Mol. Mass.:
55524.98
Organism:
Homo sapiens (Human)
Description:
P43490
Residue:
491
  
Inhibitor
Name:
BDBM81392
Synonyms:
MPI-0482593
Type:
Small organic molecule
Emp. Form.:
C32H34ClN7O2
Mol. Mass.:
584.111
SMILES:
CN1CCN(Cc2nc3cc(Cl)c(CN(CC#C)c4ccc(cc4)C(=O)NCc4ccccn4)cc3c(=O)n2C)CC1
: