Target
Phosphatidylinositol 4,5-bisphosphate 3-kinase catalytic subunit delta isoform
Ligand
BDBM50239740
Substrate
Meas. Tech.
ChEMBL_1666747 (CHEMBL4016543)
IC50
16±n/a nM
Citation
 Liu, QShi, QMarcoux, DBatt, DGCornelius, LQin, LYRuan, ZNeels, JBeaudoin-Bertrand, MSrivastava, ASLi, LCherney, RJGong, HWatterson, SHWeigelt, CGillooly, KMMcIntyre, KWXie, JHObermeier, MTFura, ASleczka, BStefanski, KFancher, RMPadmanabhan, SRp, TKundu, IRajareddy, KSmith, RHennan, JKXing, DFan, JLevesque, PCRuan, QPitt, SZhang, RPedicord, DPan, JYarde, MLu, HLippy, JGoldstine, CSkala, SRampulla, RAMathur, AGupta, AArunachalam, PNSack, JSMuckelbauer, JKCvijic, MESalter-Cid, LMBhide, RSPoss, MAHynes, JCarter, PHMacor, JERuepp, SSchieven, GLTino, JA Identification of a Potent, Selective, and Efficacious Phosphatidylinositol 3-Kinase? (PI3K?) Inhibitor for the Treatment of Immunological Disorders. J Med Chem 60:5193-5208 (2017)  
Target
Name:
Phosphatidylinositol 4,5-bisphosphate 3-kinase catalytic subunit delta isoform
Synonyms:
PI3-kinase p110 subunit delta PI3-kinase subunit p110-delta PIK3CD Phosphatidylinositol 4,5-biphosphate 3-kinase catalytic subunit delta (PIK3CD) Phosphatidylinositol 4,5-bisphosphate 3-kinase 110 kDa catalytic subunit delta (PI3K delta) Phosphatidylinositol 4,5-bisphosphate 3-kinase catalytic subunit delta (PI3Kdelta) Phosphatidylinositol 4,5-bisphosphate 3-kinase catalytic subunit delta isoform (PI3K delta) Phosphatidylinositol 4,5-bisphosphate 3-kinase catalytic subunit delta isoform (PI3K-delta) Phosphatidylinositol 4,5-bisphosphate 3-kinase catalytic subunit delta isoform (PI3Kdelta)
Type:
Enzyme Subunit
Mol. Mass.:
119489.41
Organism:
Homo sapiens (Human)
Description:
O00329
Residue:
1044
  
Inhibitor
Name:
BDBM50239740
Synonyms:
CHEMBL4092344 | US10214537, Example 625
Type:
Small organic molecule
Emp. Form.:
C23H25F3N6O3
Mol. Mass.:
490.4782
SMILES:
CC(O)c1ccc(cc1N1CCN(C(C)=O)C(C)(C)C1=O)-c1cc(c2c(N)ncnn12)C(F)(F)F
: