Target
Muscarinic acetylcholine receptor M1
Ligand
BDBM50240692
Substrate
Meas. Tech.
ChEMBL_1668507 (CHEMBL4018395)
EC50
63±n/a nM
Citation
 Davoren, JEGarnsey, MPettersen, BBrodney, MAEdgerton, JRFortin, JPGrimwood, SHarris, ARJenkinson, SKenakin, TLazzaro, JTLee, CWLotarski, SMNottebaum, LO'Neil, SVPopiolek, MRamsey, SSteyn, SJThorn, CAZhang, LWebb, D Design and Synthesis of?- and?-Lactam M J Med Chem 60:6649-6663 (2017)  
Target
Name:
Muscarinic acetylcholine receptor M1
Synonyms:
ACM1_HUMAN Cholinergic receptor, muscarinic 1 | Cholinergic, muscarinic M1
Type:
Protein
Mol. Mass.:
51442.54
Organism:
Homo sapiens (Human)
Description:
P11229
Residue:
460
  
Inhibitor
Name:
BDBM50240692
Synonyms:
CHEMBL4078588
Type:
Small organic molecule
Emp. Form.:
C25H25N3O2
Mol. Mass.:
399.4849
SMILES:
Cc1ccc(Cc2cc3c(ncn([C@H]4CCCC[C@@H]4O)c3=O)c3ccccc23)cn1
: