Target
Muscarinic acetylcholine receptor M1
Ligand
BDBM50240693
Substrate
Meas. Tech.
ChEMBL_1668507 (CHEMBL4018395)
EC50
60±n/a nM
Citation
 Davoren, JEGarnsey, MPettersen, BBrodney, MAEdgerton, JRFortin, JPGrimwood, SHarris, ARJenkinson, SKenakin, TLazzaro, JTLee, CWLotarski, SMNottebaum, LO'Neil, SVPopiolek, MRamsey, SSteyn, SJThorn, CAZhang, LWebb, D Design and Synthesis of?- and?-Lactam M J Med Chem 60:6649-6663 (2017)  
Target
Name:
Muscarinic acetylcholine receptor M1
Synonyms:
ACM1_HUMAN Cholinergic receptor, muscarinic 1 | Cholinergic, muscarinic M1
Type:
Protein
Mol. Mass.:
51442.54
Organism:
Homo sapiens (Human)
Description:
P11229
Residue:
460
  
Inhibitor
Name:
BDBM50240693
Synonyms:
CHEMBL4097569
Type:
Small organic molecule
Emp. Form.:
C22H23N3O3S
Mol. Mass.:
409.501
SMILES:
Cc1cnc(cc1Cc1ccc(cc1)-c1cscn1)C(=O)N[C@H]1CCOC[C@@H]1O
: