Target
Muscarinic acetylcholine receptor M1
Ligand
BDBM50240694
Substrate
Meas. Tech.
ChEMBL_1668607 (CHEMBL4018495)
Ki
16±n/a nM
Citation
 Davoren, JEGarnsey, MPettersen, BBrodney, MAEdgerton, JRFortin, JPGrimwood, SHarris, ARJenkinson, SKenakin, TLazzaro, JTLee, CWLotarski, SMNottebaum, LO'Neil, SVPopiolek, MRamsey, SSteyn, SJThorn, CAZhang, LWebb, D Design and Synthesis of?- and?-Lactam M J Med Chem 60:6649-6663 (2017)  
Target
Name:
Muscarinic acetylcholine receptor M1
Synonyms:
ACM1_HUMAN Cholinergic receptor, muscarinic 1 | Cholinergic, muscarinic M1
Type:
Protein
Mol. Mass.:
51442.54
Organism:
Homo sapiens (Human)
Description:
P11229
Residue:
460
  
Inhibitor
Name:
BDBM50240694
Synonyms:
CHEMBL4067722
Type:
Small organic molecule
Emp. Form.:
C24H24N2O4
Mol. Mass.:
404.4584
SMILES:
Cc1cc2CN([C@H]3CCOC[C@@H]3O)C(=O)c2cc1Cc1ccc(cc1)-c1cocn1
: