Target
Acidic mammalian chitinase
Ligand
BDBM50243694
Substrate
Meas. Tech.
ChEMBL_1672910 (CHEMBL4022939)
IC50
13200±n/a nM
Citation
 Mazur, MOlczak, JOlejniczak, SKoralewski, RCzestkowski, WJedrzejczak, AGolab, JDzwonek, KDymek, BSklepkiewicz, PLZagozdzon, ANoonan, TMahboubi, KConway, BSheeler, RBeckett, PHungerford, WMPodjarny, AMitschler, ACousido-Siah, AFadel, FGolebiowski, A Targeting Acidic Mammalian chitinase Is Effective in Animal Model of Asthma. J Med Chem 61:695-710 (2018)  
Target
Name:
Acidic mammalian chitinase
Synonyms:
AMCase CHIA Lung-specific protein TSA1902
Type:
Protein
Mol. Mass.:
52266.66
Organism:
Homo sapiens (Human)
Description:
Q9BZP6
Residue:
476
  
Inhibitor
Name:
BDBM50243694
Synonyms:
CHEMBL4067632
Type:
Small organic molecule
Emp. Form.:
C20H32N6
Mol. Mass.:
356.5083
SMILES:
CN(CCc1ccc(cc1)C(C)(C)C)C1CCN(CC1)c1nc(N)n[nH]1
: