Target
Leucine-rich repeat serine/threonine-protein kinase 2
Ligand
BDBM254931
Substrate
Meas. Tech.
ChEMBL_1681544 (CHEMBL4031821)
Ki
0.100000±n/a nM
Citation
 Williamson, DSSmith, GPAcheson-Dossang, PBedford, STChell, VChen, IJDaechsel, JCADaniels, ZDavid, LDokurno, PHentzer, MHerzig, MCHubbard, REMoore, JDMurray, JBNewland, SRay, SCShaw, TSurgenor, AETerry, LThirstrup, KWang, YChristensen, KV Design of Leucine-Rich Repeat Kinase 2 (LRRK2) Inhibitors Using a Crystallographic Surrogate Derived from Checkpoint Kinase 1 (CHK1). J Med Chem 60:8945-8962 (2017)  
Target
Name:
Leucine-rich repeat serine/threonine-protein kinase 2
Synonyms:
Dardarin LRRK2_HUMAN Leucine-rich repeat serine/threonine-protein kinase 2 PARK8
Type:
Protein
Mol. Mass.:
286113.20
Organism:
Homo sapiens (Human)
Description:
Q5S007
Residue:
2527
  
Inhibitor
Name:
BDBM254931
Synonyms:
US9499542, 14 | US9675594, 14
Type:
Small organic molecule
Emp. Form.:
C19H16N6
Mol. Mass.:
328.3705
SMILES:
Cc1cccc(c1)-c1cc(Nc2ccn(C)n2)nc2[nH]cc(C#N)c12
: